NO,����,����_�J�i,�Z��,����,�ܓx,�o�x,�W��,�d�b�ԍ�,�����ԍ�,�s�撬���R�[�h,�s���{����,�s�撬����,�ЊQ���_�^��,�ЊQ���_�R����A�y�Η��y�ђn����,�ЊQ���_����,�ЊQ���_�n�k,�ЊQ���_�Ôg,�ЊQ���_��K�͂ȉΎ�,�ЊQ���_�����×�,�ЊQ���_�ΎR����,�w����Ƃ̏d��,�z����e�l��,�ΏۂƂȂ钬��E������,URL,���l
1,�킩���Ⴟ���̋L�O�^������(�㏬���O���E���h),���J�V���`�R�N�^�C�L�l���E���h�E�R�E�G��,���m���O�H�S������㏬���O����181�Ԓn,,35.34425109,136.9203251,,,,233617,���m��,�����,,,,1,,1,,,,,,,
2,����k���w�Z ,�I�I�O�`�L�^�V���E�K�b�R�E,���m���O�H�S������������O����258�Ԓn,,35.33977936,136.9231473,,,,233617,���m��,�����,1,,,1,,1,1,,1,,,,
3,���N�����Z���^�[�i�قق��݃v���U�j,�P���R�E�u���J�Z���^�[,���m���O�H�S������`�E�꒚��35�Ԓn,,35.32862969,136.9101114,,,,233617,���m��,�����,1,,,1,,1,1,,1,,,,
4,�����P�u�h�ЃZ���^�[,�T�c�L�K�I�J�{�E�T�C�Z���^�[,���m���O�H�S������������u�񒚖�258�Ԓn,,35.34445339,136.9089391,,,,233617,���m��,�����,,,,1,,1,,,1,,,,
5,����쏬�w�Z ,�I�I�O�`�~�i�~�V���E�K�b�R�E,���m���O�H�S������ޗǎq�O����116�Ԓn,,35.31937606,136.8957696,,,,233617,���m��,�����,1,,,1,,1,1,,1,,,,
6,�H�c�O���E���h,�A�L�^�O�����h,���m���O�H�S������H�c�񒚖�44�Ԓn1,,35.32271307,136.9043098,,,,233617,���m��,�����,,,,1,,1,,,,,,,
7,����������,�`���E�I�E�R�E�~���J��,���m���O�H�S������`�E�꒚��47�Ԓn,,35.32861169,136.9109241,,,,233617,���m��,�����,1,,,1,,1,1,,1,,,,
8,������w�Z,�I�I�O�`�`���E�K�b�R�E,���m���O�H�S������ۈ꒚��38�Ԓn,,35.33233484,136.9046294,,,,233617,���m��,�����,1,,,1,,1,1,,1,,,,
9,��������w�Z,�I�I�O�`�j�V�V���E�K�b�R�E,���m���O�H�S������]��Z����440�Ԓn,,35.3383647,136.9048951,,,,233617,���m��,�����,,,,1,,1,,,1,,,,
10,�͖k�O���E���h ,�R�M�^�O���E���h,���m���O�H�S������͖k�O����25�Ԓn,,35.34485474,136.9337353,,,,233617,���m��,�����,,,,1,,1,,,,,,,
11,�����^����,�\�E�S�E�E���h�E�W���E,���m���O�H�S������������Z����150�Ԓn,,35.33040641,136.909307,,,,233617,���m��,�����,,,,1,,1,,,,,,,
12,�����オ�W���e���L��,�^�Z�_�C�K�c�h�E�C�R�C�q���o,���m���O�H�S������鉮�~�꒚��308�Ԓn,,35.34114698,136.9173907,,,,233617,���m��,�����,,,,1,,1,,,,,,,
13,����k�h�ЃZ���^�[,�I�I�O�`�L�^�{�E�T�C�Z���^�[,���m���O�H�S������鉮�~�꒚��308�Ԓn,,35.34069495,136.9166586,,,,233617,���m��,�����,1,,,1,,1,1,,1,,,,
